Skip to content

chore(deps): update Native SDK to v0.17.2 #13116

chore(deps): update Native SDK to v0.17.2

chore(deps): update Native SDK to v0.17.2 #13116

Triggered via pull request October 7, 2026 03:13
Status Success
Total duration 4m 32s
Artifacts 6

agp-matrix.yml

on: pull_request
Matrix: agp-matrix-compatibility
Fit to window
Zoom out
Zoom in

Annotations

11 errors and 6 notices
io.sentry.uitest.android.ReplayTest ► composeReplayDoesNotLeak: sentry-android-integration-tests/sentry-uitest-android/build/outputs/androidTest-results/connected/release/TEST-test(AVD) - 11.xml#L0
Failed test found in: sentry-android-integration-tests/sentry-uitest-android/build/outputs/androidTest-results/connected/release/TEST-test(AVD) - 11.xml Error: org.junit.AssumptionViolatedException: got: <false>, expected: is <true>
io.sentry.uitest.android.ReplaySnapshotTest ► captureComposeReplayFrameSnapshots: sentry-android-integration-tests/sentry-uitest-android/build/outputs/androidTest-results/connected/release/TEST-test(AVD) - 11.xml#L0
Failed test found in: sentry-android-integration-tests/sentry-uitest-android/build/outputs/androidTest-results/connected/release/TEST-test(AVD) - 11.xml Error: org.junit.AssumptionViolatedException: got: <false>, expected: is <true>
io.sentry.uitest.android.EnvelopeTests ► checkEnvelopeProfiledTransaction: sentry-android-integration-tests/sentry-uitest-android/build/outputs/androidTest-results/connected/release/TEST-test(AVD) - 11.xml#L0
Failed test found in: sentry-android-integration-tests/sentry-uitest-android/build/outputs/androidTest-results/connected/release/TEST-test(AVD) - 11.xml Error: org.junit.AssumptionViolatedException: got: <[null]>, expected: every item is not null
io.sentry.uitest.android.EnvelopeTests ► checkTimedOutProfile: sentry-android-integration-tests/sentry-uitest-android/build/outputs/androidTest-results/connected/release/TEST-test(AVD) - 11.xml#L0
Failed test found in: sentry-android-integration-tests/sentry-uitest-android/build/outputs/androidTest-results/connected/release/TEST-test(AVD) - 11.xml Error: org.junit.AssumptionViolatedException: Sometimes traceFile does not exist for profiles on emulators and it fails. Although, Android Runtime is the one that manages the file, so something must be wrong with Debug.startMethodTracing
io.sentry.uitest.android.AutomaticSpansTest ► checkAppStartFramesMeasurements: sentry-android-integration-tests/sentry-uitest-android/build/outputs/androidTest-results/connected/release/TEST-test(AVD) - 11.xml#L0
Failed test found in: sentry-android-integration-tests/sentry-uitest-android/build/outputs/androidTest-results/connected/release/TEST-test(AVD) - 11.xml Error: org.junit.AssumptionViolatedException: got: <false>, expected: is <true>
io.sentry.uitest.android.UserInteractionTests ► composableSwipeGeneratesMatchingBreadcrumb: sentry-android-integration-tests/sentry-uitest-android/build/outputs/androidTest-results/connected/release/TEST-test(AVD) - 11.xml#L0
Failed test found in: sentry-android-integration-tests/sentry-uitest-android/build/outputs/androidTest-results/connected/release/TEST-test(AVD) - 11.xml Error: org.junit.AssumptionViolatedException: got: <false>, expected: is <true>
io.sentry.uitest.android.UserInteractionTests ► composableClickGeneratesMatchingBreadcrumb: sentry-android-integration-tests/sentry-uitest-android/build/outputs/androidTest-results/connected/release/TEST-test(AVD) - 11.xml#L0
Failed test found in: sentry-android-integration-tests/sentry-uitest-android/build/outputs/androidTest-results/connected/release/TEST-test(AVD) - 11.xml Error: org.junit.AssumptionViolatedException: got: <false>, expected: is <true>
io.sentry.uitest.android.ReplayTest ► composeReplayDoesNotLeak: sentry-android-integration-tests/sentry-uitest-android/build/outputs/androidTest-results/connected/release/TEST-test(AVD) - 11.xml#L0
Failed test found in: sentry-android-integration-tests/sentry-uitest-android/build/outputs/androidTest-results/connected/release/TEST-test(AVD) - 11.xml Error: org.junit.AssumptionViolatedException: got: <false>, expected: is <true>
io.sentry.uitest.android.EnvelopeTests ► checkEnvelopeProfiledTransaction: sentry-android-integration-tests/sentry-uitest-android/build/outputs/androidTest-results/connected/release/TEST-test(AVD) - 11.xml#L0
Failed test found in: sentry-android-integration-tests/sentry-uitest-android/build/outputs/androidTest-results/connected/release/TEST-test(AVD) - 11.xml Error: org.junit.AssumptionViolatedException: got: <[null]>, expected: every item is not null
io.sentry.uitest.android.EnvelopeTests ► checkTimedOutProfile: sentry-android-integration-tests/sentry-uitest-android/build/outputs/androidTest-results/connected/release/TEST-test(AVD) - 11.xml#L0
Failed test found in: sentry-android-integration-tests/sentry-uitest-android/build/outputs/androidTest-results/connected/release/TEST-test(AVD) - 11.xml Error: org.junit.AssumptionViolatedException: Sometimes traceFile does not exist for profiles on emulators and it fails. Although, Android Runtime is the one that manages the file, so something must be wrong with Debug.startMethodTracing
io.sentry.uitest.android.AutomaticSpansTest ► checkAppStartFramesMeasurements: sentry-android-integration-tests/sentry-uitest-android/build/outputs/androidTest-results/connected/release/TEST-test(AVD) - 11.xml#L0
Failed test found in: sentry-android-integration-tests/sentry-uitest-android/build/outputs/androidTest-results/connected/release/TEST-test(AVD) - 11.xml Error: org.junit.AssumptionViolatedException: got: <false>, expected: is <true>
AGP Matrix Release - AGP 9.0.0 - Integrations false
"The ubuntu-latest label will migrate to Ubuntu 26 beginning October 19, 2026. For more information, see https://github.com/actions/runner-images/issues/14748"
AGP Matrix Release - AGP 9.4.0 - Integrations true
"The ubuntu-latest label will migrate to Ubuntu 26 beginning October 19, 2026. For more information, see https://github.com/actions/runner-images/issues/14748"
AGP Matrix Release - AGP 9.2.1 - Integrations true
"The ubuntu-latest label will migrate to Ubuntu 26 beginning October 19, 2026. For more information, see https://github.com/actions/runner-images/issues/14748"
AGP Matrix Release - AGP 9.0.0 - Integrations true
"The ubuntu-latest label will migrate to Ubuntu 26 beginning October 19, 2026. For more information, see https://github.com/actions/runner-images/issues/14748"
AGP Matrix Release - AGP 9.4.0 - Integrations false
"The ubuntu-latest label will migrate to Ubuntu 26 beginning October 19, 2026. For more information, see https://github.com/actions/runner-images/issues/14748"
AGP Matrix Release - AGP 9.2.1 - Integrations false
"The ubuntu-latest label will migrate to Ubuntu 26 beginning October 19, 2026. For more information, see https://github.com/actions/runner-images/issues/14748"

Artifacts

Produced during runtime
Name Size Digest
test-results-AGP9.0.0-Integrationsfalse
7.17 MB
sha256:27d24c4db9ffce86cd6f75c38df5f59a546dbd4397e8c83100b7040fe39b9b0e
test-results-AGP9.0.0-Integrationstrue
7.3 MB
sha256:bfb5c3a08317c367ed0d09d66e4a5bf7db243af4ca01adbce0be25f9a80530e5
test-results-AGP9.2.1-Integrationsfalse
19.1 MB
sha256:f22f47db5edda1910af6439f2fcd5a8d711f924091a2c749d1b8dee03f8c4b3a
test-results-AGP9.2.1-Integrationstrue
19.4 MB
sha256:e38d6b6eb44cf8591f217c1bf0e8d4e76344575ce3580bd8ae44c6add0c5a050
test-results-AGP9.4.0-Integrationsfalse
19.4 MB
sha256:7cb4ebfd973fb7c7bceb0c9bfb8e9fe4e6a170a88206d2ac4f133b33c8aea31e
test-results-AGP9.4.0-Integrationstrue
19.7 MB
sha256:dd6bac3dc82a76a6ba124ec937f8a71f2779a65dfad10ab05a0cb2ec9a5e3c3b